{"text_format":"1","workbook":"xlsx","n_sheets":11,"sheets":["申込について（選手必読）","大会要項（富山県用要項）","各団体(個人）申込書記入例(必読)","男子ﾃﾞｰﾀ貼付ｼｰﾄ","【様式1-1】男子団体（個人）申込書","女子ﾃﾞｰﾀ貼付ｼｰﾄ","【様式1-2】女子申込書","【様式5-1】宿泊要項","【様式5-2】宿泊申込書","【様式5-3】領収書依頼書","【様式5-4】ホテルリスト富山編 "],"not_rendered":{"charts":0,"images":3,"macros":1,"external_links":1,"defined_names":16,"comments":4,"pivot_tables":0},"unopened":[],"bounds":{"document_bytes":16777216,"sheet_cells":100000,"rows_first":2000,"rows_last":500,"rows_between":2000,"halvings":0,"cell_chars":16384,"cell_head_chars":4096},"cells_cut":0,"cells_raw":0,"read":"whole","date_system":"1900"}

{"sheet":"申込について（選手必読）","index":0,"n_rows":84,"n_cols":11,"rows_kept":84,"cut":false,"hidden":false,"merged":[[0,0,0,18],[2,0,2,18],[4,0,4,18],[5,0,5,18],[20,1,20,3],[20,4,20,9],[20,10,20,17],[27,1,27,3],[21,1,21,3],[21,10,21,17],[22,1,22,3],[22,10,22,17],[23,1,23,3],[23,10,23,17],[24,1,24,3],[24,10,24,17],[25,1,25,3],[26,1,26,3],[26,10,26,17],[54,3,55,18],[28,1,28,3],[28,4,28,9],[28,10,28,17],[29,1,29,3],[29,4,29,9],[29,10,29,17]]}
["令和３年６月３０日"]
[]
["第65回北陸陸上競技選手権大会の申込要領"]
[]
["　　　　　　　　　　　　　　　　　　　　　　　　　　　　　　（一財）富山陸上競技協会"]
["事務局"]
[]
["１　関係資料の入手"]
[null,"次のファイルを　富山陸協HPよりダウンロードして、必要事項を入力して下さい。"]
[null,"（１）　ファイル名　：　「2021北陸選手権要項（富山県選手用）」　"]
[null,"この申込ファイルはマクロを含んでいます。以下の警告が出た場合は、「コンテンツの有効化」をクリックしてください。"]
[]
[]
[]
[]
{"$rows_left_out":70}
{"sheet":"大会要項（富山県用要項）","index":1,"n_rows":120,"n_cols":15,"rows_kept":120,"cut":false,"hidden":false,"merged":[[0,0,0,14],[1,0,1,14],[38,2,39,15],[111,5,111,6],[111,7,111,8],[81,3,81,4],[81,5,81,13],[51,2,52,15],[58,2,59,15],[61,2,62,15],[112,5,112,6],[112,7,112,8],[108,5,108,6],[108,7,108,8],[109,5,109,6],[109,7,109,8],[110,5,110,6],[110,7,110,8]]}
["第６５回 北 陸 陸 上 競 技 選 手 権 大 会 要 項(案)"]
["兼 第１０６回日本陸上競技選手権大会北陸地域予選会"]
[]
[]
[null,null,"※新型コロナウイルスの対応策について"]
[null,null,"　　本協会主催大会では、日本陸協競技連盟の「陸上競技活動再開についてのガイダンス」に"]
[null,null,"　準拠し競技会運営を行います。大会参加者の皆様は、感染症対策を徹底したうえでのご参加を"]
[null,null,"　お願い致します。"]
[null,null,"　　また、今後の感染状況によっては大会要項等を変更する可能性がありますので、予めご了承"]
[null,null,"　ください。"]
[null,null,"　　尚、大会に関する最新情報は随時「富山陸上競技協会ＨＰ」に掲載いたしますので、ご確認"]
[null,null,"　をお願い致します"]
[]
[]
["１主　　催",null,"北陸陸上競技協会"]
{"$rows_left_out":106}
{"sheet":"各団体(個人）申込書記入例(必読)","index":2,"n_rows":81,"n_cols":24,"rows_kept":81,"cut":false,"hidden":false,"merged":[[71,9,71,10],[69,9,69,10],[68,9,68,10],[67,9,67,10],[70,9,70,10],[50,0,51,0],[50,1,50,2],[50,3,51,3],[50,4,50,5],[50,6,51,6],[50,16,50,20],[50,21,51,21],[62,14,62,15],[47,3,47,10],[47,17,47,20],[48,4,48,15],[50,7,51,7],[50,9,51,9],[64,14,64,15],[66,14,66,15],[68,14,68,15],[70,14,70,15],[50,11,51,11],[50,12,50,15],[80,3,80,8],[75,15,75,18],[76,15,76,18],[77,3,77,5],[78,3,78,8],[79,3,79,8]]}
["競技会参加申込の入力方法"]
[]
[null,"０．","この申込ファイルはマクロを含んでいます。以下の警告が出た場合は、「コンテンツの有効化」をクリックしてください。"]
[]
[]
[]
[]
[]
[]
[]
[null,"１．","「JAAF START」 のページにおいて、「閲覧」 メニューの 「生徒情報確認/変更」 から 「CSVS(新形式2018以降)作成」 をクリックし、CSVファイルを作成する。（一般・学生もこの流れに準ずる）"]
[null,null,"作成したCSVデータを貼り付ける。その際、男子のデータは 「男子ﾃﾞｰﾀ貼付ｼｰﾄ」 に、女子のデータは 「女子ﾃﾞｰﾀ貼付ｼｰﾄ」 に貼り付ける。"]
[null,null,"「都道府県(学連)登録番号」 (もしくはＡ列) が昇順になるように並べ替える。 ( 「ナンバー順に並び替え」 ボタンで並び替えてください。)"]
[]
[]
{"$rows_left_out":67}
{"sheet":"男子ﾃﾞｰﾀ貼付ｼｰﾄ","index":3,"n_rows":201,"n_cols":24,"rows_kept":201,"cut":false,"hidden":false,"merged":[[1,0,1,2]]}
[]
["↓この3列には貼り付けないで！↓",null,null,"JAAF ID","会員名","会員名\nカナ","会員名\n英字(姓)","会員名\n英字(名)","国籍","性\n別","登録都道\n府県コード","登録都道府県名","団体ID","団体名","団体名\nカナ","団体名\n略称","団体名\n略称カナ","生年月日","都道府県(学連)登録番号","旧団体\nコード","備考","学年","団体\n区分","陸連団体"]
[{"$f":"IF(S3=\"\",\"\",S3)","v":""},{"$f":"IF(F3=\"\",\"\",ASC(F3))","v":""},{"$f":"IF(G3=\"\",\"\",G3&\" \"&H3)","v":""}]
["","",""]
["","",""]
["","",""]
["","",""]
["","",""]
["","",""]
["","",""]
["","",""]
["","",""]
["","",""]
["","",""]
["","",""]
{"$rows_left_out":187}
{"sheet":"【様式1-1】男子団体（個人）申込書","index":4,"n_rows":67,"n_cols":22,"rows_kept":67,"cut":false,"hidden":false,"merged":[[5,0,6,0],[5,1,5,2],[5,3,6,3],[5,5,6,5],[5,6,6,6],[5,4,6,4],[0,20,0,21],[65,3,65,8],[66,3,66,8],[63,3,63,5],[64,3,64,8],[5,21,6,21],[1,15,1,17],[61,13,61,16],[62,13,62,16],[1,5,1,12],[3,5,3,12],[5,7,6,7],[5,9,6,9],[5,11,6,11],[5,12,5,15],[5,16,5,20]]}
[null,null,null,null,null,null,null,null,null,null,null,null,null,null,null,null,null,null,null,null,"【様式1-1】"]
[null,null,null,"大会名",null,"第６５回北陸地域陸上競技選手権大会",null,null,null,null,null,null,null,null,null,"参加申込一覧表（　男子　）"]
[]
[null,null,null,"所属学校・団体名 ",null,null,null,null,null,null,null,null,null,{"$f":"IF(F4=\"\",\"\",男子ﾃﾞｰﾀ貼付ｼｰﾄ!T3)","v":""}]
[]
[null,"ﾅﾝﾊﾞｰ",null,"氏　名","ﾌﾘｶﾞﾅ\n(半角ｶﾀｶﾅ)","ｱﾙﾌｧﾍﾞｯﾄ表記","性別","学年","生年月日","所属","登録","国籍","各県選手権決勝の記録・順位",null,null,null,"有効期間内の自己最高記録（標準突破記録の記載を含む）",null,null,null,null,"備考"]
[null,"北","県",null,null,null,null,null,"西暦8桁の数字",null,"都道府県",null,"種目","記録","順位","年月(4桁)","記録","順位","年月(4桁)","大会名","場所"]
[1,null,null,{"$f":"IF($C8=\"\",\"\",VLOOKUP($C8,男子ﾃﾞｰﾀ貼付ｼｰﾄ!$A$3:$W$201,5))","v":""},{"$f":"IF($C8=\"\",\"\",VLOOKUP($C8,男子ﾃﾞｰﾀ貼付ｼｰﾄ!$A$3:$W$201,2))","v":""},{"$f":"IF($C8=\"\",\"\",VLOOKUP($C8,男子ﾃﾞｰﾀ貼付ｼｰﾄ!$A$3:$W$201,3))","v":""},"男",{"$f":"IF($C8=\"\",\"\",VLOOKUP($C8,男子ﾃﾞｰﾀ貼付ｼｰﾄ!$A$3:$W$201,22))","v":""},{"$f":"IF($C8=\"\",\"\",VLOOKUP($C8,男子ﾃﾞｰﾀ貼付ｼｰﾄ!$A$3:$W$201,18))","v":""},{"$f":"IF($C8=\"\",\"\",VLOOKUP($C8,男子ﾃﾞｰﾀ貼付ｼｰﾄ!$A$3:$W$201,16))","v":""},{"$f":"IF($C8=\"\",\"\",VLOOKUP($C8,男子ﾃﾞｰﾀ貼付ｼｰﾄ!$A$3:$W$201,12))","v":""},{"$f":"IF($C8=\"\",\"\",VLOOKUP($C8,男子ﾃﾞｰﾀ貼付ｼｰﾄ!$A$3:$W$201,9))","v":""}]
[2,null,null,{"$f":"IF($C9=\"\",\"\",VLOOKUP($C9,男子ﾃﾞｰﾀ貼付ｼｰﾄ!$A$3:$W$201,5))","v":""},{"$f":"IF($C9=\"\",\"\",VLOOKUP($C9,男子ﾃﾞｰﾀ貼付ｼｰﾄ!$A$3:$W$201,2))","v":""},{"$f":"IF($C9=\"\",\"\",VLOOKUP($C9,男子ﾃﾞｰﾀ貼付ｼｰﾄ!$A$3:$W$201,3))","v":""},"男",{"$f":"IF($C9=\"\",\"\",VLOOKUP($C9,男子ﾃﾞｰﾀ貼付ｼｰﾄ!$A$3:$W$201,22))","v":""},{"$f":"IF($C9=\"\",\"\",VLOOKUP($C9,男子ﾃﾞｰﾀ貼付ｼｰﾄ!$A$3:$W$201,18))","v":""},{"$f":"IF($C9=\"\",\"\",VLOOKUP($C9,男子ﾃﾞｰﾀ貼付ｼｰﾄ!$A$3:$W$201,16))","v":""},{"$f":"IF($C9=\"\",\"\",VLOOKUP($C9,男子ﾃﾞｰﾀ貼付ｼｰﾄ!$A$3:$W$201,12))","v":""},{"$f":"IF($C9=\"\",\"\",VLOOKUP($C9,男子ﾃﾞｰﾀ貼付ｼｰﾄ!$A$3:$W$201,9))","v":""}]
[3,null,null,{"$f":"IF($C10=\"\",\"\",VLOOKUP($C10,男子ﾃﾞｰﾀ貼付ｼｰﾄ!$A$3:$W$201,5))","v":""},{"$f":"IF($C10=\"\",\"\",VLOOKUP($C10,男子ﾃﾞｰﾀ貼付ｼｰﾄ!$A$3:$W$201,2))","v":""},{"$f":"IF($C10=\"\",\"\",VLOOKUP($C10,男子ﾃﾞｰﾀ貼付ｼｰﾄ!$A$3:$W$201,3))","v":""},"男",{"$f":"IF($C10=\"\",\"\",VLOOKUP($C10,男子ﾃﾞｰﾀ貼付ｼｰﾄ!$A$3:$W$201,22))","v":""},{"$f":"IF($C10=\"\",\"\",VLOOKUP($C10,男子ﾃﾞｰﾀ貼付ｼｰﾄ!$A$3:$W$201,18))","v":""},{"$f":"IF($C10=\"\",\"\",VLOOKUP($C10,男子ﾃﾞｰﾀ貼付ｼｰﾄ!$A$3:$W$201,16))","v":""},{"$f":"IF($C10=\"\",\"\",VLOOKUP($C10,男子ﾃﾞｰﾀ貼付ｼｰﾄ!$A$3:$W$201,12))","v":""},{"$f":"IF($C10=\"\",\"\",VLOOKUP($C10,男子ﾃﾞｰﾀ貼付ｼｰﾄ!$A$3:$W$201,9))","v":""}]
[4,null,null,{"$f":"IF($C11=\"\",\"\",VLOOKUP($C11,男子ﾃﾞｰﾀ貼付ｼｰﾄ!$A$3:$W$201,5))","v":""},{"$f":"IF($C11=\"\",\"\",VLOOKUP($C11,男子ﾃﾞｰﾀ貼付ｼｰﾄ!$A$3:$W$201,2))","v":""},{"$f":"IF($C11=\"\",\"\",VLOOKUP($C11,男子ﾃﾞｰﾀ貼付ｼｰﾄ!$A$3:$W$201,3))","v":""},"男",{"$f":"IF($C11=\"\",\"\",VLOOKUP($C11,男子ﾃﾞｰﾀ貼付ｼｰﾄ!$A$3:$W$201,22))","v":""},{"$f":"IF($C11=\"\",\"\",VLOOKUP($C11,男子ﾃﾞｰﾀ貼付ｼｰﾄ!$A$3:$W$201,18))","v":""},{"$f":"IF($C11=\"\",\"\",VLOOKUP($C11,男子ﾃﾞｰﾀ貼付ｼｰﾄ!$A$3:$W$201,16))","v":""},{"$f":"IF($C11=\"\",\"\",VLOOKUP($C11,男子ﾃﾞｰﾀ貼付ｼｰﾄ!$A$3:$W$201,12))","v":""},{"$f":"IF($C11=\"\",\"\",VLOOKUP($C11,男子ﾃﾞｰﾀ貼付ｼｰﾄ!$A$3:$W$201,9))","v":""}]
[5,null,null,{"$f":"IF($C12=\"\",\"\",VLOOKUP($C12,男子ﾃﾞｰﾀ貼付ｼｰﾄ!$A$3:$W$201,5))","v":""},{"$f":"IF($C12=\"\",\"\",VLOOKUP($C12,男子ﾃﾞｰﾀ貼付ｼｰﾄ!$A$3:$W$201,2))","v":""},{"$f":"IF($C12=\"\",\"\",VLOOKUP($C12,男子ﾃﾞｰﾀ貼付ｼｰﾄ!$A$3:$W$201,3))","v":""},"男",{"$f":"IF($C12=\"\",\"\",VLOOKUP($C12,男子ﾃﾞｰﾀ貼付ｼｰﾄ!$A$3:$W$201,22))","v":""},{"$f":"IF($C12=\"\",\"\",VLOOKUP($C12,男子ﾃﾞｰﾀ貼付ｼｰﾄ!$A$3:$W$201,18))","v":""},{"$f":"IF($C12=\"\",\"\",VLOOKUP($C12,男子ﾃﾞｰﾀ貼付ｼｰﾄ!$A$3:$W$201,16))","v":""},{"$f":"IF($C12=\"\",\"\",VLOOKUP($C12,男子ﾃﾞｰﾀ貼付ｼｰﾄ!$A$3:$W$201,12))","v":""},{"$f":"IF($C12=\"\",\"\",VLOOKUP($C12,男子ﾃﾞｰﾀ貼付ｼｰﾄ!$A$3:$W$201,9))","v":""}]
[6,null,null,{"$f":"IF($C13=\"\",\"\",VLOOKUP($C13,男子ﾃﾞｰﾀ貼付ｼｰﾄ!$A$3:$W$201,5))","v":""},{"$f":"IF($C13=\"\",\"\",VLOOKUP($C13,男子ﾃﾞｰﾀ貼付ｼｰﾄ!$A$3:$W$201,2))","v":""},{"$f":"IF($C13=\"\",\"\",VLOOKUP($C13,男子ﾃﾞｰﾀ貼付ｼｰﾄ!$A$3:$W$201,3))","v":""},"男",{"$f":"IF($C13=\"\",\"\",VLOOKUP($C13,男子ﾃﾞｰﾀ貼付ｼｰﾄ!$A$3:$W$201,22))","v":""},{"$f":"IF($C13=\"\",\"\",VLOOKUP($C13,男子ﾃﾞｰﾀ貼付ｼｰﾄ!$A$3:$W$201,18))","v":""},{"$f":"IF($C13=\"\",\"\",VLOOKUP($C13,男子ﾃﾞｰﾀ貼付ｼｰﾄ!$A$3:$W$201,16))","v":""},{"$f":"IF($C13=\"\",\"\",VLOOKUP($C13,男子ﾃﾞｰﾀ貼付ｼｰﾄ!$A$3:$W$201,12))","v":""},{"$f":"IF($C13=\"\",\"\",VLOOKUP($C13,男子ﾃﾞｰﾀ貼付ｼｰﾄ!$A$3:$W$201,9))","v":""}]
[7,null,null,{"$f":"IF($C14=\"\",\"\",VLOOKUP($C14,男子ﾃﾞｰﾀ貼付ｼｰﾄ!$A$3:$W$201,5))","v":""},{"$f":"IF($C14=\"\",\"\",VLOOKUP($C14,男子ﾃﾞｰﾀ貼付ｼｰﾄ!$A$3:$W$201,2))","v":""},{"$f":"IF($C14=\"\",\"\",VLOOKUP($C14,男子ﾃﾞｰﾀ貼付ｼｰﾄ!$A$3:$W$201,3))","v":""},"男",{"$f":"IF($C14=\"\",\"\",VLOOKUP($C14,男子ﾃﾞｰﾀ貼付ｼｰﾄ!$A$3:$W$201,22))","v":""},{"$f":"IF($C14=\"\",\"\",VLOOKUP($C14,男子ﾃﾞｰﾀ貼付ｼｰﾄ!$A$3:$W$201,18))","v":""},{"$f":"IF($C14=\"\",\"\",VLOOKUP($C14,男子ﾃﾞｰﾀ貼付ｼｰﾄ!$A$3:$W$201,16))","v":""},{"$f":"IF($C14=\"\",\"\",VLOOKUP($C14,男子ﾃﾞｰﾀ貼付ｼｰﾄ!$A$3:$W$201,12))","v":""},{"$f":"IF($C14=\"\",\"\",VLOOKUP($C14,男子ﾃﾞｰﾀ貼付ｼｰﾄ!$A$3:$W$201,9))","v":""}]
[8,null,null,{"$f":"IF($C15=\"\",\"\",VLOOKUP($C15,男子ﾃﾞｰﾀ貼付ｼｰﾄ!$A$3:$W$201,5))","v":""},{"$f":"IF($C15=\"\",\"\",VLOOKUP($C15,男子ﾃﾞｰﾀ貼付ｼｰﾄ!$A$3:$W$201,2))","v":""},{"$f":"IF($C15=\"\",\"\",VLOOKUP($C15,男子ﾃﾞｰﾀ貼付ｼｰﾄ!$A$3:$W$201,3))","v":""},"男",{"$f":"IF($C15=\"\",\"\",VLOOKUP($C15,男子ﾃﾞｰﾀ貼付ｼｰﾄ!$A$3:$W$201,22))","v":""},{"$f":"IF($C15=\"\",\"\",VLOOKUP($C15,男子ﾃﾞｰﾀ貼付ｼｰﾄ!$A$3:$W$201,18))","v":""},{"$f":"IF($C15=\"\",\"\",VLOOKUP($C15,男子ﾃﾞｰﾀ貼付ｼｰﾄ!$A$3:$W$201,16))","v":""},{"$f":"IF($C15=\"\",\"\",VLOOKUP($C15,男子ﾃﾞｰﾀ貼付ｼｰﾄ!$A$3:$W$201,12))","v":""},{"$f":"IF($C15=\"\",\"\",VLOOKUP($C15,男子ﾃﾞｰﾀ貼付ｼｰﾄ!$A$3:$W$201,9))","v":""}]
{"$rows_left_out":53}
{"sheet":"女子ﾃﾞｰﾀ貼付ｼｰﾄ","index":5,"n_rows":201,"n_cols":24,"rows_kept":201,"cut":false,"hidden":false,"merged":[[1,0,1,2]]}
[]
["↓この3列には貼り付けないで！↓",null,null,"JAAF ID","会員名","会員名\nカナ","会員名\n英字(姓)","会員名\n英字(名)","国籍","性\n別","登録都道\n府県コード","登録都道\n府県名","団体ID","団体名","団体名\nカナ","団体名\n略称","団体名\n略称カナ","生年月日","都道府県(学連)登録番号","旧団体\nコード","備考","学年","団体\n区分","陸連団体"]
[{"$f":"IF(S3=\"\",\"\",S3)","v":""},{"$f":"IF(F3=\"\",\"\",ASC(F3))","v":""},{"$f":"IF(G3=\"\",\"\",G3&\" \"&H3)","v":""}]
["","",""]
["","",""]
["","",""]
["","",""]
["","",""]
["","",""]
["","",""]
["","",""]
["","",""]
["","",""]
["","",""]
["","",""]
{"$rows_left_out":187}
{"sheet":"【様式1-2】女子申込書","index":6,"n_rows":68,"n_cols":22,"rows_kept":68,"cut":false,"hidden":false,"merged":[[61,13,61,16],[62,13,62,16],[66,3,66,8],[1,5,1,12],[3,5,3,12],[5,16,5,20],[67,3,67,8],[64,3,64,4],[65,3,65,8],[5,5,6,5],[5,11,6,11],[5,7,6,7],[5,9,6,9],[0,20,0,21],[5,21,6,21],[5,0,6,0],[5,1,5,2],[5,3,6,3],[5,4,6,4],[5,6,6,6],[1,15,1,17],[5,12,5,15]]}
[null,null,null,null,null,null,null,null,null,null,null,null,null,null,null,null,null,null,null,null,"【様式1-2】"]
[null,null,null,"大会名",null,"第６５回北陸地域陸上競技選手権大会",null,null,null,null,null,null,null,null,null,"参加申込一覧表（　女子　）"]
[]
[null,null,null,"所属学校・団体名 ",null,null,null,null,null,null,null,null,null,{"$f":"IF(F4=\"\",\"\",女子ﾃﾞｰﾀ貼付ｼｰﾄ!T3)","v":""}]
[]
[null,"ﾅﾝﾊﾞｰ",null,"氏　名","ﾌﾘｶﾞﾅ\n(半角ｶﾀｶﾅ)","ｱﾙﾌｧﾍﾞｯﾄ表記","性別","学年","生年月日","所属","登録","国籍","各県選手権決勝の記録・順位",null,null,null,"有効期間内の自己最高記録（標準突破記録の記載を含む）",null,null,null,null,"備考"]
[null,"北","県",null,null,null,null,null,"西暦8桁の数字",null,"都道府県",null,"種目","記録","順位","年月(4桁)","記録","順位","年月(4桁)","大会名","場所"]
[1,null,null,{"$f":"IF($C8=\"\",\"\",VLOOKUP($C8,女子ﾃﾞｰﾀ貼付ｼｰﾄ!$A$3:$W$201,5))","v":""},{"$f":"IF($C8=\"\",\"\",VLOOKUP($C8,女子ﾃﾞｰﾀ貼付ｼｰﾄ!$A$3:$W$201,2))","v":""},{"$f":"IF($C8=\"\",\"\",VLOOKUP($C8,女子ﾃﾞｰﾀ貼付ｼｰﾄ!$A$3:$W$201,3))","v":""},"女",{"$f":"IF($C8=\"\",\"\",VLOOKUP($C8,女子ﾃﾞｰﾀ貼付ｼｰﾄ!$A$3:$W$201,22))","v":""},{"$f":"IF($C8=\"\",\"\",VLOOKUP($C8,女子ﾃﾞｰﾀ貼付ｼｰﾄ!$A$3:$W$201,18))","v":""},{"$f":"IF($C8=\"\",\"\",VLOOKUP($C8,女子ﾃﾞｰﾀ貼付ｼｰﾄ!$A$3:$W$201,16))","v":""},{"$f":"IF($C8=\"\",\"\",VLOOKUP($C8,女子ﾃﾞｰﾀ貼付ｼｰﾄ!$A$3:$W$201,12))","v":""},{"$f":"IF($C8=\"\",\"\",VLOOKUP($C8,女子ﾃﾞｰﾀ貼付ｼｰﾄ!$A$3:$W$201,9))","v":""}]
[2,null,null,{"$f":"IF($C9=\"\",\"\",VLOOKUP($C9,女子ﾃﾞｰﾀ貼付ｼｰﾄ!$A$3:$W$201,5))","v":""},{"$f":"IF($C9=\"\",\"\",VLOOKUP($C9,女子ﾃﾞｰﾀ貼付ｼｰﾄ!$A$3:$W$201,2))","v":""},{"$f":"IF($C9=\"\",\"\",VLOOKUP($C9,女子ﾃﾞｰﾀ貼付ｼｰﾄ!$A$3:$W$201,3))","v":""},"女",{"$f":"IF($C9=\"\",\"\",VLOOKUP($C9,女子ﾃﾞｰﾀ貼付ｼｰﾄ!$A$3:$W$201,22))","v":""},{"$f":"IF($C9=\"\",\"\",VLOOKUP($C9,女子ﾃﾞｰﾀ貼付ｼｰﾄ!$A$3:$W$201,18))","v":""},{"$f":"IF($C9=\"\",\"\",VLOOKUP($C9,女子ﾃﾞｰﾀ貼付ｼｰﾄ!$A$3:$W$201,16))","v":""},{"$f":"IF($C9=\"\",\"\",VLOOKUP($C9,女子ﾃﾞｰﾀ貼付ｼｰﾄ!$A$3:$W$201,12))","v":""},{"$f":"IF($C9=\"\",\"\",VLOOKUP($C9,女子ﾃﾞｰﾀ貼付ｼｰﾄ!$A$3:$W$201,9))","v":""}]
[3,null,null,{"$f":"IF($C10=\"\",\"\",VLOOKUP($C10,女子ﾃﾞｰﾀ貼付ｼｰﾄ!$A$3:$W$201,5))","v":""},{"$f":"IF($C10=\"\",\"\",VLOOKUP($C10,女子ﾃﾞｰﾀ貼付ｼｰﾄ!$A$3:$W$201,2))","v":""},{"$f":"IF($C10=\"\",\"\",VLOOKUP($C10,女子ﾃﾞｰﾀ貼付ｼｰﾄ!$A$3:$W$201,3))","v":""},"女",{"$f":"IF($C10=\"\",\"\",VLOOKUP($C10,女子ﾃﾞｰﾀ貼付ｼｰﾄ!$A$3:$W$201,22))","v":""},{"$f":"IF($C10=\"\",\"\",VLOOKUP($C10,女子ﾃﾞｰﾀ貼付ｼｰﾄ!$A$3:$W$201,18))","v":""},{"$f":"IF($C10=\"\",\"\",VLOOKUP($C10,女子ﾃﾞｰﾀ貼付ｼｰﾄ!$A$3:$W$201,16))","v":""},{"$f":"IF($C10=\"\",\"\",VLOOKUP($C10,女子ﾃﾞｰﾀ貼付ｼｰﾄ!$A$3:$W$201,12))","v":""},{"$f":"IF($C10=\"\",\"\",VLOOKUP($C10,女子ﾃﾞｰﾀ貼付ｼｰﾄ!$A$3:$W$201,9))","v":""}]
[4,null,null,{"$f":"IF($C11=\"\",\"\",VLOOKUP($C11,女子ﾃﾞｰﾀ貼付ｼｰﾄ!$A$3:$W$201,5))","v":""},{"$f":"IF($C11=\"\",\"\",VLOOKUP($C11,女子ﾃﾞｰﾀ貼付ｼｰﾄ!$A$3:$W$201,2))","v":""},{"$f":"IF($C11=\"\",\"\",VLOOKUP($C11,女子ﾃﾞｰﾀ貼付ｼｰﾄ!$A$3:$W$201,3))","v":""},"女",{"$f":"IF($C11=\"\",\"\",VLOOKUP($C11,女子ﾃﾞｰﾀ貼付ｼｰﾄ!$A$3:$W$201,22))","v":""},{"$f":"IF($C11=\"\",\"\",VLOOKUP($C11,女子ﾃﾞｰﾀ貼付ｼｰﾄ!$A$3:$W$201,18))","v":""},{"$f":"IF($C11=\"\",\"\",VLOOKUP($C11,女子ﾃﾞｰﾀ貼付ｼｰﾄ!$A$3:$W$201,16))","v":""},{"$f":"IF($C11=\"\",\"\",VLOOKUP($C11,女子ﾃﾞｰﾀ貼付ｼｰﾄ!$A$3:$W$201,12))","v":""},{"$f":"IF($C11=\"\",\"\",VLOOKUP($C11,女子ﾃﾞｰﾀ貼付ｼｰﾄ!$A$3:$W$201,9))","v":""}]
[5,null,null,{"$f":"IF($C12=\"\",\"\",VLOOKUP($C12,女子ﾃﾞｰﾀ貼付ｼｰﾄ!$A$3:$W$201,5))","v":""},{"$f":"IF($C12=\"\",\"\",VLOOKUP($C12,女子ﾃﾞｰﾀ貼付ｼｰﾄ!$A$3:$W$201,2))","v":""},{"$f":"IF($C12=\"\",\"\",VLOOKUP($C12,女子ﾃﾞｰﾀ貼付ｼｰﾄ!$A$3:$W$201,3))","v":""},"女",{"$f":"IF($C12=\"\",\"\",VLOOKUP($C12,女子ﾃﾞｰﾀ貼付ｼｰﾄ!$A$3:$W$201,22))","v":""},{"$f":"IF($C12=\"\",\"\",VLOOKUP($C12,女子ﾃﾞｰﾀ貼付ｼｰﾄ!$A$3:$W$201,18))","v":""},{"$f":"IF($C12=\"\",\"\",VLOOKUP($C12,女子ﾃﾞｰﾀ貼付ｼｰﾄ!$A$3:$W$201,16))","v":""},{"$f":"IF($C12=\"\",\"\",VLOOKUP($C12,女子ﾃﾞｰﾀ貼付ｼｰﾄ!$A$3:$W$201,12))","v":""},{"$f":"IF($C12=\"\",\"\",VLOOKUP($C12,女子ﾃﾞｰﾀ貼付ｼｰﾄ!$A$3:$W$201,9))","v":""}]
[6,null,null,{"$f":"IF($C13=\"\",\"\",VLOOKUP($C13,女子ﾃﾞｰﾀ貼付ｼｰﾄ!$A$3:$W$201,5))","v":""},{"$f":"IF($C13=\"\",\"\",VLOOKUP($C13,女子ﾃﾞｰﾀ貼付ｼｰﾄ!$A$3:$W$201,2))","v":""},{"$f":"IF($C13=\"\",\"\",VLOOKUP($C13,女子ﾃﾞｰﾀ貼付ｼｰﾄ!$A$3:$W$201,3))","v":""},"女",{"$f":"IF($C13=\"\",\"\",VLOOKUP($C13,女子ﾃﾞｰﾀ貼付ｼｰﾄ!$A$3:$W$201,22))","v":""},{"$f":"IF($C13=\"\",\"\",VLOOKUP($C13,女子ﾃﾞｰﾀ貼付ｼｰﾄ!$A$3:$W$201,18))","v":""},{"$f":"IF($C13=\"\",\"\",VLOOKUP($C13,女子ﾃﾞｰﾀ貼付ｼｰﾄ!$A$3:$W$201,16))","v":""},{"$f":"IF($C13=\"\",\"\",VLOOKUP($C13,女子ﾃﾞｰﾀ貼付ｼｰﾄ!$A$3:$W$201,12))","v":""},{"$f":"IF($C13=\"\",\"\",VLOOKUP($C13,女子ﾃﾞｰﾀ貼付ｼｰﾄ!$A$3:$W$201,9))","v":""}]
[7,null,null,{"$f":"IF($C14=\"\",\"\",VLOOKUP($C14,女子ﾃﾞｰﾀ貼付ｼｰﾄ!$A$3:$W$201,5))","v":""},{"$f":"IF($C14=\"\",\"\",VLOOKUP($C14,女子ﾃﾞｰﾀ貼付ｼｰﾄ!$A$3:$W$201,2))","v":""},{"$f":"IF($C14=\"\",\"\",VLOOKUP($C14,女子ﾃﾞｰﾀ貼付ｼｰﾄ!$A$3:$W$201,3))","v":""},"女",{"$f":"IF($C14=\"\",\"\",VLOOKUP($C14,女子ﾃﾞｰﾀ貼付ｼｰﾄ!$A$3:$W$201,22))","v":""},{"$f":"IF($C14=\"\",\"\",VLOOKUP($C14,女子ﾃﾞｰﾀ貼付ｼｰﾄ!$A$3:$W$201,18))","v":""},{"$f":"IF($C14=\"\",\"\",VLOOKUP($C14,女子ﾃﾞｰﾀ貼付ｼｰﾄ!$A$3:$W$201,16))","v":""},{"$f":"IF($C14=\"\",\"\",VLOOKUP($C14,女子ﾃﾞｰﾀ貼付ｼｰﾄ!$A$3:$W$201,12))","v":""},{"$f":"IF($C14=\"\",\"\",VLOOKUP($C14,女子ﾃﾞｰﾀ貼付ｼｰﾄ!$A$3:$W$201,9))","v":""}]
[8,null,null,{"$f":"IF($C15=\"\",\"\",VLOOKUP($C15,女子ﾃﾞｰﾀ貼付ｼｰﾄ!$A$3:$W$201,5))","v":""},{"$f":"IF($C15=\"\",\"\",VLOOKUP($C15,女子ﾃﾞｰﾀ貼付ｼｰﾄ!$A$3:$W$201,2))","v":""},{"$f":"IF($C15=\"\",\"\",VLOOKUP($C15,女子ﾃﾞｰﾀ貼付ｼｰﾄ!$A$3:$W$201,3))","v":""},"女",{"$f":"IF($C15=\"\",\"\",VLOOKUP($C15,女子ﾃﾞｰﾀ貼付ｼｰﾄ!$A$3:$W$201,22))","v":""},{"$f":"IF($C15=\"\",\"\",VLOOKUP($C15,女子ﾃﾞｰﾀ貼付ｼｰﾄ!$A$3:$W$201,18))","v":""},{"$f":"IF($C15=\"\",\"\",VLOOKUP($C15,女子ﾃﾞｰﾀ貼付ｼｰﾄ!$A$3:$W$201,16))","v":""},{"$f":"IF($C15=\"\",\"\",VLOOKUP($C15,女子ﾃﾞｰﾀ貼付ｼｰﾄ!$A$3:$W$201,12))","v":""},{"$f":"IF($C15=\"\",\"\",VLOOKUP($C15,女子ﾃﾞｰﾀ貼付ｼｰﾄ!$A$3:$W$201,9))","v":""}]
{"$rows_left_out":54}
{"sheet":"【様式5-1】宿泊要項","index":7,"n_rows":61,"n_cols":17,"rows_kept":61,"cut":false,"hidden":false,"merged":[[54,1,55,2],[54,3,55,8],[54,9,54,11],[54,12,54,14],[55,9,55,11],[55,12,55,14],[53,3,53,5],[53,6,53,8],[14,16,15,16],[45,1,45,16],[53,12,53,14],[31,3,32,12],[25,1,25,3],[25,4,25,6],[25,7,25,15],[53,9,53,11],[26,1,27,3],[26,4,27,6],[26,7,27,15],[28,1,29,3],[28,4,29,6],[28,7,29,15],[13,1,15,3],[13,4,13,8],[13,9,13,12],[13,13,13,15],[52,3,52,5],[52,6,52,8],[52,9,52,11],[52,12,52,14],[41,1,41,16],[52,1,53,2],[21,1,21,15],[22,1,22,15],[23,1,23,15],[24,1,24,2],[16,1,17,3],[16,4,16,8],[16,9,16,12],[16,13,16,15],[17,4,17,8],[17,9,17,12],[17,13,17,15],[0,0,2,16],[3,0,4,16],[10,1,10,2],[12,1,12,3],[12,4,12,8],[12,9,12,12],[12,13,12,15],[14,4,14,8],[14,9,14,12],[14,13,14,15],[15,4,15,8],[15,9,15,12],[15,13,15,15]]}
["第65回北陸陸上競技選手権大会\n兼 第106回日本陸上競技選手権大会北陸地域予選会"]
[]
[]
["宿泊・弁当　申込要項"]
[]
[null,"　第６５回北陸陸上競技選手権大会　兼 第１０６回日本陸上競技選手権大会北陸地域予選会に参加される"]
[null,"選手ならびに引率の方の宿泊・弁当の申込につきまして、下記にてご案内申し上げます。"]
[]
[null,"１．宿泊施設ならびに宿泊料金・昼食弁当のご案内。"]
[null,"ご利用宿泊日　令和３年８月２０日（金）・８月２１日（土）"]
[null,"【宿泊施設】",null,"※料金は、税込表示"]
[null,"欠食については朝食＠５００円を差し引きさせていただきます。（Ｓタイプを除く）"]
[null,"タイプ記号",null,null,"食事条件",null,null,null,null,"料金",null,null,null,"タイプ記号",null,null,"申込可能人員"]
[null,"富山市内\n（洋室タイプ）",null,null,"1泊朝食",null,null,null,null,10000,null,null,null,"S－２",null,null,"１００名"]
[null,null,null,null,"1泊2食",null,null,null,null,10000,null,null,null,"Ａ－1",null,null,"３７０名"]
{"$rows_left_out":47}
{"sheet":"【様式5-2】宿泊申込書","index":8,"n_rows":51,"n_cols":22,"rows_kept":51,"cut":false,"hidden":false,"merged":[[50,1,53,6],[16,14,16,15],[16,16,16,18],[17,14,17,15],[17,16,17,18],[22,2,22,7],[16,10,18,13],[20,8,20,9],[20,10,20,13],[20,2,20,7],[33,2,33,7],[34,2,34,7],[35,2,35,7],[25,2,25,7],[26,2,26,7],[27,2,27,7],[28,2,28,7],[21,2,21,7],[40,2,40,7],[41,2,41,7],[30,2,30,7],[31,2,31,7],[32,2,32,7],[40,8,40,9],[1,18,1,21],[1,13,1,17],[46,17,46,18],[48,1,48,6],[49,1,49,6],[29,2,29,7],[24,2,24,7],[46,20,46,21],[2,5,2,19],[16,8,18,9],[42,2,42,7],[43,2,43,7],[44,2,44,7],[16,2,18,7],[21,8,21,9],[22,8,22,9],[23,8,23,9],[24,8,24,9],[25,8,25,9],[26,8,26,9],[36,2,36,7],[37,2,37,7],[38,2,38,7],[39,2,39,7],[41,8,41,9],[27,8,27,9],[28,8,28,9],[29,8,29,9],[30,8,30,9],[42,8,42,9],[43,8,43,9],[44,8,44,9],[33,8,33,9],[34,8,34,9],[35,8,35,9],[36,8,36,9],[37,8,37,9],[38,8,38,9],[31,8,31,9],[32,8,32,9],[45,10,45,13],[46,10,46,13],[16,20,18,21],[24,20,24,21],[25,20,25,21],[26,20,26,21],[27,20,27,21],[28,20,28,21],[29,20,29,21],[30,20,30,21],[39,10,39,13],[40,10,40,13],[41,10,41,13],[42,10,42,13],[43,10,43,13],[44,10,44,13],[33,10,33,13],[34,10,34,13],[35,10,35,13],[36,10,36,13],[37,10,37,13],[38,10,38,13],[27,10,27,13],[28,10,28,13],[45,20,45,21],[4,20,6,21],[3,20,3,21],[3,1,3,18],[4,1,5,18],[7,1,7,4],[9,1,9,4],[11,1,11,4],[37,20,37,21],[38,20,38,21],[45,1,46,9],[19,2,19,7],[19,8,19,9],[19,10,19,13],[40,20,40,21],[41,20,41,21],[42,20,42,21],[31,20,31,21],[32,20,32,21],[33,20,33,21],[16,1,18,1],[19,20,19,21],[20,20,20,21],[21,20,21,21],[13,1,13,4],[13,14,13,20],[15,12,15,21],[15,1,15,11],[43,20,43,21],[44,20,44,21],[39,20,39,21],[34,20,34,21],[35,20,35,21],[36,20,36,21],[22,20,22,21],[23,20,23,21],[21,10,21,13],[22,10,22,13],[23,10,23,13],[23,2,23,7],[29,10,29,13],[30,10,30,13],[31,10,31,13],[32,10,32,13],[24,10,24,13],[25,10,25,13],[26,10,26,13],[39,8,39,9]]}
[]
[null,"タイセイツアーズ　第６５回　北陸陸上競技選手権大会係　行き",null,null,null,null,null,null,null,null,null,null,null,"ＦＡＸ　０７６－４５５－８２２２",null,null,null,null,"令和３年　　　　月　　　　　日"]
[]
[null,"　第６５回　北陸陸上競技選手権大会　兼第１０６回日本陸上競技選手権大会地域予選会  ",null,null,null,null,null,null,null,null,null,null,null,null,null,null,null,null,null,null,"県　　名"]
[null,"宿　　泊　　申　　込　　書"]
[]
[]
[null,"郵送先・所在地",null,null,null,"〒"]
[]
[null,"申込責任者",null,null,null,null,null,null,null,null,null,null,null,null,"☎","（　　　　　　　　）　　　　　　　－"]
[]
[null,"連絡責任者",null,null,null,null,null,null,null,null,null,null,null,null,"Ｆａｘ","（　　　　　　　　）　　　　　　　－"]
[]
[null,"携帯電話",null,null,null,null,null,null,null,null,null,null,null,null,"宿泊期日別人員内訳（○をご記入ください。）\n＊宿泊・朝食・夕食欄に○をご記入ください。"]
[]
{"$rows_left_out":37}
{"sheet":"【様式5-3】領収書依頼書","index":9,"n_rows":35,"n_cols":4,"rows_kept":35,"cut":false,"hidden":false,"merged":[[14,0,14,2],[14,3,14,8],[0,0,1,8],[2,0,3,8],[5,0,5,8],[10,3,10,8],[11,3,11,8],[13,0,13,2],[13,3,13,8]]}
["第６５回北陸陸上競技選手権大会"]
[]
["領収書依頼書"]
[]
[]
["領収書が必要な団体様は事前に下記内容をご記入の上、事前に弊社まで郵送・ＦＡＸ・Ｅ－Ｍａｉｌにて"]
["お送りいただけますでしょうか。"]
["お忙しい中、大変申し訳ございませんがご協力お願い致します。"]
[]
["（有）タイセイツアーズ　　松本　宛　"]
["　",null,null,"FAX：０７６－４５５－８２２２（TEL：０７６－４５５－８２１１）"]
[null,null,null,"E-Mail：　taｉｓｅｉｃｏ＠ｔｏｐａｚ．oｃｎ．nｅ．jｐ"]
[]
["団体名"]
["監督氏名（引率責任者名）"]
{"$rows_left_out":21}
{"sheet":"【様式5-4】ホテルリスト富山編 ","index":10,"n_rows":20,"n_cols":7,"rows_kept":20,"cut":false,"hidden":false,"merged":[[18,0,19,0],[18,1,19,1],[18,2,19,2],[18,6,19,6],[11,1,12,1],[11,2,12,2],[11,4,12,4],[11,6,12,6],[13,1,14,1],[13,2,14,2],[13,4,14,4],[13,6,14,6],[7,1,8,1],[7,2,8,2],[7,4,8,4],[7,6,8,6],[9,1,10,1],[9,2,10,2],[9,4,10,4],[9,6,10,6],[3,1,4,1],[3,2,4,2],[3,4,4,4],[3,6,4,6],[5,1,6,1],[5,2,6,2],[5,4,6,4],[5,6,6,6]]}
["宿泊地区","宿泊地区","施設名","ホテル条件","部屋タイプ","1人あたりの料金","会場まで距離"]
["S２","富山駅北","オークスカナルパークホテル","１泊朝食付き税込み","シングル・ツイン","１０、０００円","９．８Ｋｍ"]
["S２","富山駅前","アパヴィラホテル<富山駅前>","１泊朝食付き税込み","シングル","９，５００円","９．１Ｋｍ"]
["Ａ１","富山駅前","アパホテル<富山駅前>","１泊２食付き税込み","シングル・ツイン","１０、０００円","９．８Ｋｍ"]
["Ａ２",null,null,"１泊朝食付き税込み",null,"８，５００円"]
["Ａ１","富山駅前","富山地鉄ホテル","１泊２食付き税込み","シングル・ツイン","１０、０００円","９．８Ｋｍ"]
["Ａ２",null,null,"１泊朝食付き税込み",null,"８，５００円"]
["Ａ１","富山インター付近","ホテルルートイン富山インター","１泊２食付き税込み","シングル・ツイン","１０、０００円","４．０Ｋｍ"]
["Ａ２",null,null,"１泊朝食付き税込み",null,"８，５００円"]
["Ａ１","富山郊外","アパホテル<富山>","１泊２食付き税込み","シングル・ツイン","１０、０００円","１１．７Ｋｍ"]
["Ａ２",null,null,"１泊朝食付き税込み",null,"８，５００円"]
["Ａ１","富山駅前","ホテルルートイン富山駅前","１泊２食付き税込み","シングル・ツイン","１０、０００円","９．１Ｋｍ"]
["Ａ２",null,null,"１泊朝食付き税込み",null,"８，５００円"]
["Ａ１","富山駅北","とやま自遊館","１泊２食付き税込み","シングル・ツイン","１０、０００円","９．８Ｋｍ"]
["Ａ２",null,null,"１泊朝食付き税込み",null,"８，５００円"]
{"$rows_left_out":5}